Kernel/Speakup Compilation Problems

Jan Buchal buchal at
Wed Feb 7 04:06:48 EST 2007

>>>>> "GN" == Gregory Nowak <greg at> writes:

    GN> The problem is that hasn't been updated.
    GN> Daniel Drake checked in the fixes for 2.6.20 sometime early
    GN> yesterday morning,and if retrieved directly from
    GN> itself, speakup compiles into, and works fine
    GN> with 2.6.20.

I tried both mirrors and now with the
same result:

speakup.c:2682: error: (Each undeclared identifier is reported only once
drivers/char/speakup/speakup.c:2682: error: for each function it appears in.)
make[4]: *** [drivers/char/speakup/speakup.o] Error 1
make[3]: *** [drivers/char/speakup] Error 2
make[2]: *** [drivers/char] Error 2
make[1]: *** [drivers] Error 2
make[1]: Leaving directory `/usr/src/linux-2.6.20'
make: *** [debian/stamp-build-kernel] Error 2

I use debian testing/unstable, kernel 2.6.20 and 64-bit platform.

Any idea?



Jan Buchal
Tel: (00420) 24 24 86 008
Mob: (00420) 608023021

More information about the Speakup mailing list