Gnome-speech build error with espeak

Georgina Joyce gena-j at
Thu Aug 2 09:57:12 EDT 2007


I can't build gnome-speech with or without the espeak flag.  What do I need to do in order to fix this problem?  Any ideas please?

Making all in espeak
make[3]: Entering directory
if gcc -DHAVE_CONFIG_H -I. -I. -I../.. -I../.. -I../..
-I../../gnome-speech -pthread -DORBIT2=1 -I/usr/include/glib-2.0
-I/opt/gnome-2.18.3/include/libbonobo-2.0   -Wall -Wmissing-prototypes
-Wnested-externs -Wpointer-arith -Wno-sign-compare
-I/usr/include/espeak    -O2 -march=athlon-xp -pipe -fomit-frame-pointer
-MT espeaksynthesisdriver.o -MD -MP -MF
".deps/espeaksynthesisdriver.Tpo" -c -o espeaksynthesisdriver.o
espeaksynthesisdriver.c; \
        then mv -f ".deps/espeaksynthesisdriver.Tpo"
".deps/espeaksynthesisdriver.Po"; else rm -f
".deps/espeaksynthesisdriver.Tpo"; exit 1; fi
espeaksynthesisdriver.c: In function 'espeak_driverInit':
espeaksynthesisdriver.c:170: error: too few arguments to function
make[3]: *** [espeaksynthesisdriver.o] Error 1
make[3]: Leaving directory
make[2]: *** [all-recursive] Error 1
make[2]: Leaving directory `/usr/src/gena/gnome-speech-0.4.14/drivers'
make[1]: *** [all-recursive] Error 1
make[1]: Leaving directory `/usr/src/gena/gnome-speech-0.4.14'
make: *** [all] Error 2



Amateur Call: M 0 E B P

VOIP / IM: gena1959uk

More information about the Speakup mailing list