Compile Errors

Trevor Astrope astrope at
Thu Feb 10 16:09:23 EST 2005

I found a copy of speakup-1.5 I had on another machine. I'm trying to 
recompile the red hat enterprise 3 kernel on a machine I use at work, but 
I get the error below. Can anyone help?



make[1]: Circular 
dependency dropped.
sys.c:575: warning: static declaration for `set_user' follows non-static
speakup.c: In function `strlwr':
speakup.c:1259: warning: operation on `p' may be undefined
speakup.c: In function `speakup_characters_write_proc':
speakup.c:1699: structure has no member named `list'
make[4]: *** [speakup.o] Error 1
make[3]: *** [first_rule] Error 2
make[2]: *** [_subdir_speakup] Error 2
make[1]: *** [_subdir_char] Error 2
make: *** [_dir_drivers] Error 2

More information about the Speakup mailing list