Decext driver not compiling

Joseph Norton jnorton at
Sun Jun 18 18:10:48 EDT 2000

Hi Kirk and listers:

When trying to compile the 2.2.13 kernel using the decext driver (speakup
dated Jun 3), the make is interrupted and I get the following messages:

speakup_decext.c: In function `synth_write_tts':
speakup_decext.c:238: structure has no member named `list'
make[4]: *** [speakup_decext.o] Error 1
make[3]: *** [first_rule] Error 2
make[2]: *** [_subdir_speakup] Error 2
make[1]: *** [_subdir_char] Error 2
make: *** [_dir_drivers] Error 2

Yes, I did use the correct patch.

Any ideas?

More information about the Speakup mailing list